14

Why does Launchpad fail to find 'glib-compile-schemas' while building for PPA?

view full story
linux-howto

http://askubuntu.com – So, I'm trying to publish my app in my PPA, but I'm having problems related with building my app. Here you have the output: /bin/sh: 1: glib-compile-schemas: not found make[1]: *** [override_dh_install] Error 127 make[1]: Leaving directory `/build/buildd/virtuam-0.1ubuntu1' make: *** [binary] Error 2 dpkg-buildpackage: error: /usr/bin/fakeroot debian/rules binary gave error exit status 2 ****************************************************************************** Build finished at 20120709-2102 FAILED [dpkg-buildpackage died] ***************************************************************** (HowTos)