2

Midori & libunique

view story
linux-howto

http://www.linuxquestions.org – This problem affects both my -current and 64 bit multilib -current installs. Tried installing Midori from SlackBuilds but one of the depends (libunique) refuses to build on either system. Here's the log file from 64 multi -current. [code]Unique 1.1.6 Configuration: Maintainer flags: yes Debug level: no Build documentation: no Build introspection data: no Backends: Unix Domain Socket: yes D-BUS: yes Default backend: dbus make all-recursive make[1]: Entering directory `/tmp/SBo/libunique-1.1.6' Making all in build make[2]: Entering directory `/tmp/SBo/libunique-1.1.6/build' Making all in autotools make[3]: Entering directory `/tmp/SBo/libunique-1.1.6/build/autotools' make[3]: Nothing to be done for `all'. make[3]: Leaving directory `/tmp/SBo/libunique-1.1.6/build/autotools' make[3]: Entering directory `/tmp/SBo/libunique-1.1.6/build' make[3]: Nothing to be done for `all-am'. make[3]: Leaving directory `/tmp/SBo/libunique-1.1.6/build' make[2]: Leaving directory `/tmp/SBo/libunique-1.1.6/build' Making all in unique make[2]: Entering directory `/tmp/SBo/libunique-1.1.6/unique' GEN stamp-enum-types GEN stamp-marshal make all-recursive make[3]: Entering directory `/tmp/SBo/libunique-1.1.6/unique' Making all in bacon make[4]: Entering directory `/tmp/SBo/libunique-1.1.6/unique/bacon' CC libunique_bacon_la-uniquebackend-bacon.lo /bin/sh ../../libtool --silent --tag=CC --mode=compile gcc -DHAVE_CONFIG_H -I. -I../.. -I../.. -DG_LOG_DOMAIN=\"Unique-Bacon\" -DG_DISABLE_SINGLE_INCLUDES -I/usr/include/glib-2.0 -I/usr/lib64/glib-2.0/include -I/usr/include/gtk-2.0 -I/usr/lib64/gtk-2.0/include -I/usr/include/atk-1.0 -I/usr/include/cairo -I/usr/include/pango-1.0 -I/usr/include/pixman-1 -I/usr/include/freetype2 -I/usr/include/libpng12 -Werror -Wall -Wshadow -Wcast-align -Wno-uninitialized -Wempty-body -Wformat-security -Winit-self -O2 -fPIC -c -o libunique_bacon_la-uniquebackend-bacon.lo `test -f 'uniquebackend-bacon.c' || echo './'`uniquebackend-bacon.c cc1: warnings being treated as errors uniquebackend-bacon.c: In function 'unique_backend_bacon_get_type': /usr/include/glib-2.0/glib/gthread.h:339: error: dereferencing pointer 'value_location.17' does break strict-aliasing rules /usr/include/glib-2.0/glib/gthread.h:339: note: initialized from here make[4]: *** [libunique_bacon_la-uniquebackend-bacon.lo] Error 1 make[4]: Leaving directory `/tmp/SBo/libunique-1.1.6/unique/bacon' make[3]: *** [all-recursive] Error 1 make[3]: Leaving directory `/tmp/SBo/libunique-1.1.6/unique' make[2]: *** [all] Error 2 make[2]: Leaving directory `/tmp/SBo/libunique-1.1.6/unique' make[1]: *** [all-recursive] Error 1 make[1]: Leaving directory `/tmp/SBo/libunique-1.1.6' make: *** [all] Error 2 libunique: Would you like to continue processing the rest of the build queue or would you like to abort? If this failed package is a dependency of another package in the queue then it may not make sense to continue. [code] I've not had a lick of trouble with either system and other builds and the 64 bit is up to date with AlienBobs latest compilers. Any insight on this....I know I must be missing something somewhere. (HowTos)