1

Installation error

view story
linux-howto

http://www.linuxquestions.org – Hi, I`m having an error on the command make: Code: /usr/lib/gcc/i486-slackware-linux/4.7.1/../../../../i486-slackware-linux/bin/ld: testgdi.o: undefined reference to symbol 'g_free' /usr/lib/gcc/i486-slackware-linux/4.7.1/../../../../i486-slackware-linux/bin/ld: note: 'g_free' is defined in DSO /usr/lib/libglib-2.0.so.0 so try adding it to the linker command line /usr/lib/libglib-2.0.so.0: could not read symbols: Invalid operation collect2: error: ld returned 1 exit status make[2]: *** [testgdi] Error 1 make[2]: Leaving directory `/home/gustavo/libgdiplus-2.10.9/tests' make[1]: *** [all-re (HowTos)