2

Compile error

view story
linux-howto

http://forums.fedoraforum.org – hi . I want compile smaragd in fedora 17 32bit. when I run 'make' command , apear this error: Code: [  0%] Built target kwin3_smaragd_automoc [  6%] Building CXX object src/CMakeFiles/kwin3_smaragd.dir/kwin_smaragd.o /home/sayres/Downloads/smaragd-0.0.7/src/kwin_smaragd.cpp:37:19: fatal error: cairo.h: No such file or directory compilation terminated. make[2]: *** [src/CMakeFiles/kwin3_smaragd.dir/kwin_smaragd.o] Error 1 make[1]: *** [src/CMakeFiles/kwin3_smaragd.dir/all] Error 2 make: *** [all] Error 2 This error is for cairo Module.because when I want load cairo Modu (HowTos)